[Date Prev][Date Next][Thread Prev][Thread Next][Date Index][Thread Index]

2ND REQUEST: PLEASE HELP--Failed Test On Build

I'm trying to build heimdal and have run into this error upon *make check*:

PASS: n-fold-test
string_to_key(@, ) failed
should be: 01010101010101f1
result was: 0101010101010101
string_to_key(AAAAAAAA, 11119999) failed
should be: 984054d0f1a73e31
result was: 262c94e34c8fbc04
string_to_key(FFFFAAAA, NNNN6666) failed
should be: c4bf6b25adf7a4f8
result was: f71fc802192a0dd5
FAIL: string-to-key-test
PASS: derived-key-test
PASS: store-test
1 of 4 tests failed
make[3]: *** [check-TESTS] Error 1
make[3]: Leaving directory `/usr/heimdal-0.4e/lib/krb5'
make[2]: *** [check-am] Error 2
make[2]: Leaving directory `/usr/heimdal-0.4e/lib/krb5'
make[1]: *** [check-recursive] Error 1
make[1]: Leaving directory `/usr/heimdal-0.4e/lib'
make: *** [check-recursive] Error 1

How shall I solve the string-to-key problem?