[Date Prev][Date Next][Thread Prev][Thread Next][Date Index][Thread Index]

The errors during the execution of make command

These are the errors the make command gives me when i execute it. The 
snapshot is the last published

vis.c:346:52: macro "strsvisx" passed 5 arguments, but takes just 4
vis.c: In function `rk_strvisx':
vis.c:346: `strsvisx' undeclared (first use in this function)
vis.c:346: (Each undeclared identifier is reported only once
vis.c:346: for each function it appears in.)
make[3]: *** [libroken_la-vis.lo] Error 1
make[2]: *** [all] Error 2
make[1]: *** [all-recursive] Error 1
make: *** [all-recursive] Error 1