[Date Prev][Date Next][Thread Prev][Thread Next][Date Index][Thread Index]

Re: heimdal 0.8-rc3

I see the following failure on i386 during gmake all check install

gmake[3]: Leaving directory `/export/heimdal/heimdal-0.8-rc3/tests/gss'
gmake[2]: Leaving directory `/export/heimdal/heimdal-0.8-rc3/tests/gss'
Making check in plugin
gmake[2]: Entering directory `/export/heimdal/heimdal-0.8-rc3/tests/plugin'
gmake  check-TESTS check-local
gmake[3]: Entering directory `/export/heimdal/heimdal-0.8-rc3/tests/plugin'
sed -e 's,[@]srcdir[@],.,g' -e 's,[@]objdir[@],../../tests/plugin,g' -e 
's,[@]EGREP[@],/bin/grep -E,g'  < ./check-pac.in > check-pac.tmp
chmod +x check-pac.tmp
mv check-pac.tmp check-pac
Creating database
Doing database check
Starting kdc
Waiting for KDC to start, looking logfile messages.log
Have waited 2 seconds
Getting client initial tickets
Getting tickets
Verify PAC on server
ap-req: get pac
test failed
signal killing kdc
FAIL: check-pac
1 of 1 tests failed
Please report to heimdal-bugs@pdc.kth.se
gmake[3]: *** [check-TESTS] Error 1
gmake[3]: Leaving directory `/export/heimdal/heimdal-0.8-rc3/tests/plugin'
gmake[2]: *** [check-am] Error 2
gmake[2]: Leaving directory `/export/heimdal/heimdal-0.8-rc3/tests/plugin'
gmake[1]: *** [check-recursive] Error 1
gmake[1]: Leaving directory `/export/heimdal/heimdal-0.8-rc3/tests'
gmake: *** [check-recursive] Error 1
[root@switch heimdal-0.8-rc3]#

Love Hörnquist Åstrand wrote:
> Hello
> I've just created a heimdal 0.8-rc3 snapshot.
> ftp://ftp.pdc.kth.se/pub/heimdal/src/snapshots/heimdal-0.8-rc3.tar.ga
> ftp://ftp.pdc.kth.se/pub/heimdal/src/snapshots/heimdal-0.8-rc3.dmg
> Basicly what needs to happen before release is fixing (text) error 
> message
> for GSS-API mech-glue layer and testing on more platforms.
> Testing is mostly automated and very simple to set up, please read
> here if you want to contribute.
> http://www.pdc.kth.se/heimdal/help/#buildfarm
> Love

S/MIME Cryptographic Signature