[Date Prev][Date Next][Thread Prev][Thread Next][Date Index][Thread Index]

Re: heimdal on Macintosh OS X.3 ?

Am 30.01.2005 um 16:21 schrieb Love:

> "R. Welz" <linuxprodukte@gmx.de> writes:
>> Hello.
>> When I ./configure I get the following errors and make fails.
>> Is there a way to solve this?
> yes, run configure like this:
> ./configure CPPFLAGS='-DBIND8_COMPAT'
No luck, same errors. Besides sudo named -v delivers BIND 9.2.2

> or just a current snapshot (heimdal-<date>.tar.gz.
Ok. I tried heimdal-20050211, heimdal-20050210 and heimdal-20050205 but 
with no luck, see below.
Any suggestions greatly welcome!


mkdir .libs
ar cru .libs/libgssapi.a  asn1_ContextFlags.o asn1_MechType.o 
asn1_MechTypeList.o asn1_NegotiationToken.o asn1_NegTokenInit.o 
asn1_NegTokenTarg.o 8003.o accept_sec_context.o acquire_cred.o 
add_cred.o add_oid_set_member.o arcfour.o canonicalize_name.o 
ccache_name.o cfx.o compare_name.o compat.o context_time.o 
copy_ccache.o create_emtpy_oid_set.o decapsulate.o delete_sec_context.o 
display_name.o display_status.o duplicate_name.o encapsulate.o 
export_sec_context.o export_name.o external.o get_mic.o import_name.o 
import_sec_context.o indicate_mechs.o init.o init_sec_context.o 
inquire_context.o inquire_cred.o inquire_cred_by_mech.o 
inquire_mechs_for_name.o inquire_names_for_mech.o release_buffer.o 
release_cred.o release_name.o release_oid_set.o sequence.o 
process_context_token.o ticket_flags.o test_oid_set_member.o unwrap.o 
v1.o verify_mic.o wrap.o address_to_krb5addr.o
ranlib .libs/libgssapi.a
creating libgssapi.la
(cd .libs && rm -f libgssapi.la && ln -s ../libgssapi.la libgssapi.la)
gcc  -DHAVE_CONFIG_H -I. -I. -I../../include  -I../../include 
-I../../lib/roken -I../../lib/roken -I./../krb5 -I./../asn1/include    
-Wall -Wmissing-prototypes -Wpointer-arith -Wbad-function-cast 
-Wmissing-declarations -Wnested-externs -DINET6 -g -O2 -c test_cred.c
/bin/sh ../../libtool --mode=link gcc  -Wall -Wmissing-prototypes 
-Wpointer-arith -Wbad-function-cast -Wmissing-declarations 
-Wnested-externs -DINET6 -g -O2   -o test_cred  test_cred.o 
libgssapi.la -lresolv
gcc -Wall -Wmissing-prototypes -Wpointer-arith -Wbad-function-cast 
-Wmissing-declarations -Wnested-externs -DINET6 -g -O2 -o test_cred 
test_cred.o  ./.libs/libgssapi.a 
/Users/welz/Heimdal/heimdal-20050211/lib/krb5/.libs/libkrb5.a -lcrypto 
ld: Undefined symbols:
make[3]: *** [test_cred] Error 1
make[2]: *** [all] Error 2
make[1]: *** [all-recursive] Error 1
make: *** [all-recursive] Error 1

> Love